Games instantly crashes on steam

Hi!

So I have been troubleshooting this as far as I can and I have run out of ideas and google mostly returns what I have already looked at, so hopefully there is some one wiser than me at this point.

When running steam, runtime or native does not matter, the games launches and crashes more or less instantly.

I have a sample of error logs, but I don’t seem to get those errors anymore. Maybe it is because I have opted to only run with one steam, steam-runtime, to have less to troubleshoot.

Last step has been to install gamemode and try to run it with that but it did not change anything, behavior is the same.

Adding a note that this system has been running windows before, but starting games on the old ntfs filesystem as well as newly installed games on ext4 filesystem has the same behavior.

Running different games with different proton versions has the same behavior.

About the system:

mhwd -li                                                                                                                                                                   ✔ 
> Installed PCI configs:
--------------------------------------------------------------------------------
                  NAME               VERSION          FREEDRIVER           TYPE
--------------------------------------------------------------------------------
          video-nvidia            2024.05.03               false            PCI
mhwd -l                                                                                                                                                                    ✔ 
> 0000:02:00.0 (0200:10ec:8168) Network controller Realtek Semiconductor Co., Ltd.:
--------------------------------------------------------------------------------
                  NAME               VERSION          FREEDRIVER           TYPE
--------------------------------------------------------------------------------
         network-r8168            2023.09.12                true            PCI


> 0000:01:00.0 (0300:10de:1c03) Display controller nVidia Corporation:
--------------------------------------------------------------------------------
                  NAME               VERSION          FREEDRIVER           TYPE
--------------------------------------------------------------------------------
          video-nvidia            2024.05.03               false            PCI
    video-nvidia-470xx            2023.03.23               false            PCI
    video-nvidia-390xx            2023.03.23               false            PCI
           video-linux            2024.05.06                true            PCI
     video-modesetting            2020.01.13                true            PCI
            video-vesa            2017.03.12                true            PCI

linux66-nvidia 550.90.07-3

Linux -m32cd4k 6.6.32-1-MANJARO #1 SMP PREEMPT_DYNAMIC Mon May 27 03:41:25 UTC 2024 x86_64 GNU/Linux

So afaik it only runs on the nvidia card and on nvidia-550 driver.

Operating System: Manjaro Linux 
KDE Plasma Version: 6.0.5
KDE Frameworks Version: 6.2.0
Qt Version: 6.7.1
Kernel Version: 6.6.32-1-MANJARO (64-bit)
Graphics Platform: X11
Processors: 4 × Intel® Core™ i5-7400 CPU @ 3.00GHz
Memory: 15.6 Gibyte of RAM
Graphics Processor: NVIDIA GeForce GTX 1060 6GB/PCIe/SSE2
Manufacturer: ASUSTeK COMPUTER INC.
Product Name: M32CD4-K
System Version: 0604

These are the logs from one gamerun:

[2024-06-25 22:11:31] StartSession: appID 803050 session d8e14f433ba5a5e1

==> ./console_log.txt <==
[2024-06-25 22:11:31] GameAction [AppID 803050, ActionID 1] : LaunchApp changed task to CheckShaderDepotManifest with ""

==> ./cloud_log.txt <==
[2024-06-25 22:11:31] [AppID 803050] Starting sync (AC Launch,down,)
[2024-06-25 22:11:31] [AppID 803050] AutoCloud checking local state for user 881098149

==> ./console_log.txt <==
[2024-06-25 22:11:31] GameAction [AppID 803050, ActionID 1] : LaunchApp changed task to ProcessingInstallScript with ""
[2024-06-25 22:11:31] GameAction [AppID 803050, ActionID 1] : LaunchApp changed task to SynchronizingCloud with ""

==> ./cloud_log.txt <==
[2024-06-25 22:11:31] [AppID 803050] Attempting to sync from local change number '0' to global change number '0'
[2024-06-25 22:11:31] [AppID 803050] Download complete in build list

==> ./configstore_log.txt <==
[2024-06-25 22:11:32] Flushed store 'userlocal' to '/home/user/.local/share/Steam/userdata/881098149/config/localconfig.vdf'

==> ./cloud_log.txt <==
[2024-06-25 22:11:32] [AppID 803050] Successfully synced to ChangeNumber 0
[2024-06-25 22:11:32] [AppID 803050] Running AutoCloud on launch. Looking for existing files to watch:
[2024-06-25 22:11:32] [AppID 803050] AutoCloud done. Watching 0 files
[2024-06-25 22:11:32] [AppID 803050] YldWriteCacheDirectoryToFile - empty vector, deleting '/home/user/.local/share/Steam/userdata/881098149/803050/remotecache.vdf'

==> ./console_log.txt <==
[2024-06-25 22:11:32] GameAction [AppID 803050, ActionID 1] : LaunchApp changed task to ShowInterstitials with ""
[2024-06-25 22:11:32] GameAction [AppID 803050, ActionID 1] : LaunchApp waiting for user response to ShowInterstitials ""

==> ./controller_ui.txt <==
[2024-06-25 22:11:32] Warming Config Cache 803050

==> ./console_log.txt <==
[2024-06-25 22:11:32] GameAction [AppID 803050, ActionID 1] : LaunchApp continues with user response "ShowInterstitials"
[2024-06-25 22:11:32] GameAction [AppID 803050, ActionID 1] : LaunchApp changed task to SiteLicenseSeatCheckout with ""
[2024-06-25 22:11:32] GameAction [AppID 803050, ActionID 1] : LaunchApp changed task to WaitForStreamingEncoderConfig with ""
[2024-06-25 22:11:32] GameAction [AppID 803050, ActionID 1] : LaunchApp changed task to CreatingProcess with ""
[2024-06-25 22:11:32] GameAction [AppID 803050, ActionID 1] : LaunchApp waiting for user response to CreatingProcess ""

==> ./compat_log.txt <==
[2024-06-25 22:11:32] Tool 2348590 "Proton 8.0-5" has a dependency on tool 1628350.
[2024-06-25 22:11:32] Command prefix for tool 1628350 "Steam Linux Runtime 3.0 (sniper)" set to: "'/mnt/user/SteamEpicGames/SteamLibrary/steamapps/common/SteamLinuxRuntime_sniper'/_v2-entry-point --verb=waitforexitandrun -- ".
[2024-06-25 22:11:32] Command prefix for tool 2348590 "Proton 8.0-5" set to: "'/mnt/user/SteamEpicGames/SteamLibrary/steamapps/common/SteamLinuxRuntime_sniper'/_v2-entry-point --verb=waitforexitandrun -- '/mnt/user/SteamEpicGames/SteamLibrary/steamapps/common/Proton 8.0'/proton waitforexitandrun ".

==> ./controller.txt <==
[2024-06-25 22:11:32] Opted-in Controller Mask for AppId 803050: 0

==> ./shader_log.txt <==
[2024-06-25 22:11:32] Setting MESA_GLSL_CACHE_DIR=/mnt/user/games/SteamLibrary/steamapps/shadercache/803050 MESA_DISK_CACHE_READ_ONLY_FOZ_DBS=steam_cache,steam_precompiled

==> ./content_log.txt <==
[2024-06-25 22:11:32] AppID 803050 adding PID 9616 as a tracked process "gamemoderun /home/user/.local/share/Steam/ubuntu12_32/reaper SteamLaunch AppId=803050 -- /home/user/.local/share/Steam/ubuntu12_32/steam-launch-wrapper -- '/mnt/user/SteamEpicGames/SteamLibrary/steamapps/common/SteamLinuxRuntime_sniper'/_v2-entry-point --verb=waitforexitandrun -- '/mnt/user/SteamEpicGames/SteamLibrary/steamapps/common/Proton 8.0'/proton waitforexitandrun  '/mnt/user/games/SteamLibrary/steamapps/common/Per Aspera/Per Aspera.exe'"
[2024-06-25 22:11:32] SSGL: InternalUpdateClientGame indicates change to games list

==> ./console-linux.txt <==
chdir "/mnt/user/games/SteamLibrary/steamapps/common/Per Aspera"

==> ./content_log.txt <==
[2024-06-25 22:11:32] AppID 803050 state changed : Fully Installed,App Running,

==> ./console-linux.txt <==
ERROR: ld.so: object '/home/user/.local/share/Steam/ubuntu12_32/gameoverlayrenderer.so' from LD_PRELOAD cannot be preloaded (wrong ELF class: ELFCLASS32): ignored.
ERROR: ld.so: object '/home/user/.local/share/Steam/ubuntu12_32/gameoverlayrenderer.so' from LD_PRELOAD cannot be preloaded (wrong ELF class: ELFCLASS32): ignored.
ERROR: ld.so: object '/home/user/.local/share/Steam/ubuntu12_32/gameoverlayrenderer.so' from LD_PRELOAD cannot be preloaded (wrong ELF class: ELFCLASS32): ignored.

==> ./console_log.txt <==
[2024-06-25 22:11:32] GameAction [AppID 803050, ActionID 1] : LaunchApp continues with user response "CreatingProcess"
[2024-06-25 22:11:32] /bin/sh\0-c\0gamemoderun /home/user/.local/share/Steam/ubuntu12_32/reaper SteamLaunch AppId=803050 -- /home/user/.local/share/Steam/ubuntu12_32/steam-launch-wrapper -- '/mnt/user/SteamEpicGames/SteamLibrary/steamapps/common/SteamLinuxRuntime_sniper'/_v2-entry-point --verb=waitforexitandrun -- '/mnt/user/SteamEpicGames/SteamLibrary/steamapps/common/Proton 8.0'/proton waitforexitandrun  '/mnt/user/games/SteamLibrary/steamapps/common/Per Aspera/Per Aspera.exe'\0
[2024-06-25 22:11:32] Game process added : AppID 803050 "gamemoderun /home/user/.local/share/Steam/ubuntu12_32/reaper SteamLaunch AppId=803050 -- /home/user/.local/share/Steam/ubuntu12_32/steam-launch-wrapper -- '/mnt/user/SteamEpicGames/SteamLibrary/steamapps/common/SteamLinuxRuntime_sniper'/_v2-entry-point --verb=waitforexitandrun -- '/mnt/user/SteamEpicGames/SteamLibrary/steamapps/common/Proton 8.0'/proton waitforexitandrun  '/mnt/user/games/SteamLibrary/steamapps/common/Per Aspera/Per Aspera.exe'", ProcID 9616, IP 0.0.0.0:0
[2024-06-25 22:11:32] Controller slots reset

==> ./controller_ui.txt <==
[2024-06-25 22:11:32] Warming Config Cache 803050

==> ./console-linux.txt <==
Adding process 9616 for gameID 803050

==> ./streaming_log.txt <==


[2024-06-25 22:11:32] Client version: 1718904662
[2024-06-25 22:11:32][40.774441] Adding process 9616 for gameID 803050

==> ./compat_log.txt <==
[2024-06-25 22:11:32] Tool 2348590 "Proton 8.0-5" has a dependency on tool 1628350.
[2024-06-25 22:11:32] Command prefix for tool 1628350 "Steam Linux Runtime 3.0 (sniper)" set to: "'/mnt/user/SteamEpicGames/SteamLibrary/steamapps/common/SteamLinuxRuntime_sniper'/_v2-entry-point --verb=run -- ".
[2024-06-25 22:11:32] Command prefix for tool 2348590 "Proton 8.0-5" set to: "'/mnt/user/SteamEpicGames/SteamLibrary/steamapps/common/SteamLinuxRuntime_sniper'/_v2-entry-point --verb=run -- '/mnt/user/SteamEpicGames/SteamLibrary/steamapps/common/Proton 8.0'/proton run ".

==> ./console-linux.txt <==
ERROR: ld.so: object 'libgamemodeauto.so.0' from LD_PRELOAD cannot be preloaded (wrong ELF class: ELFCLASS64): ignored.
ERROR: ld.so: object '/home/user/.local/share/Steam/ubuntu12_64/gameoverlayrenderer.so' from LD_PRELOAD cannot be preloaded (wrong ELF class: ELFCLASS64): ignored.
ERROR: ld.so: object '/home/user/.local/share/Steam/ubuntu12_32/gameoverlayrenderer.so' from LD_PRELOAD cannot be preloaded (wrong ELF class: ELFCLASS32): ignored.

==> ./console_log.txt <==
[2024-06-25 22:11:32] GameAction [AppID 803050, ActionID 1] : LaunchApp changed task to WaitingGameWindow with ""
[2024-06-25 22:11:32] GameAction [AppID 803050, ActionID 1] : LaunchApp changed task to Completed with ""

==> ./content_log.txt <==
[2024-06-25 22:11:32] AppID 803050 adding PID 9630 as a tracked process

==> ./console-linux.txt <==
Adding process 9630 for gameID 803050

==> ./streaming_log.txt <==
[2024-06-25 22:11:32][40.893545] Adding process 9630 for gameID 803050

==> ./shader_log.txt <==
[2024-06-25 22:11:32] AppID 803050 exited.

==> ./compat_log.txt <==
[2024-06-25 22:11:32] OnAppLifetimeNotification: release session(s) for appID 803050

==> ./stats_log.txt <==
[2024-06-25 22:11:32] [AppID 803050] CAPIJobStoreUserStats::BInit() - no upload needed

==> ./content_log.txt <==
[2024-06-25 22:11:32] AppID 803050 no longer tracking PID 9630, exit code -1
[2024-06-25 22:11:32] AppID 803050 no longer tracking PID 9616, exit code 0

==> ./console-linux.txt <==
Uploaded AppInterfaceStats to Steam

==> ./content_log.txt <==
[2024-06-25 22:11:32] AppID 803050 state changed : Fully Installed,
[2024-06-25 22:11:32] Remove 803050 from running list

==> ./configstore_log.txt <==
[2024-06-25 22:11:32] Flushed store 'userlocal' to '/home/user/.local/share/Steam/userdata/881098149/config/localconfig.vdf'

==> ./shader_log.txt <==
[2024-06-25 22:11:32] Unknown shader cache type, ignoring.

==> ./console_log.txt <==
[2024-06-25 22:11:32] Game process removed: AppID 803050 "gamemoderun /home/user/.local/share/Steam/ubuntu12_32/reaper SteamLaunch AppId=803050 -- /home/user/.local/share/Steam/ubuntu12_32/steam-launch-wrapper -- '/mnt/user/SteamEpicGames/SteamLibrary/steamapps/common/SteamLinuxRuntime_sniper'/_v2-entry-point --verb=waitforexitandrun -- '/mnt/user/SteamEpicGames/SteamLibrary/steamapps/common/Proton 8.0'/proton waitforexitandrun  '/mnt/user/games/SteamLibrary/steamapps/common/Per Aspera/Per Aspera.exe'", ProcID 9616 
[2024-06-25 22:11:32] ThreadGetProcessExitCode: no such process 9630

==> ./cloud_log.txt <==
[2024-06-25 22:11:32] [AppID 803050] Starting sync (up,AC Exit,)
[2024-06-25 22:11:32] [AppID 803050] Running AutoCloud on exit. Looking for new and updated files
[2024-06-25 22:11:32] [AppID 803050]     Evaluating rule 0 with root="GameInstall" path="SaveGames/" pattern="*.save" (recursive)
[2024-06-25 22:11:32] [AppID 803050]         Found 0 files that match /mnt/user/games/SteamLibrary/steamapps/common/Per Aspera/SaveGames/*.save
[2024-06-25 22:11:32] [AppID 803050] AutoCloud complete

==> ./controller.txt <==
[2024-06-25 22:11:32] No cached sticky mapping in ActivateActionSet.

==> ./console-linux.txt <==
Removing process 9630 for gameID 803050

==> ./streaming_log.txt <==
[2024-06-25 22:11:32][41.050178] Removing process 9630 for gameID 803050
[2024-06-25 22:11:32][41.050279] Removing process 9616 for gameID 803050

==> ./console-linux.txt <==
Removing process 9616 for gameID 803050

==> ./cloud_log.txt <==
[2024-06-25 22:11:33] [AppID 803050] Need to sync from local change number '0' to global change number '0', but not attempting now
[2024-06-25 22:11:33] [AppID 803050] Upload complete in build list
[2024-06-25 22:11:33] [AppID 803050] YldWriteCacheDirectoryToFile - empty vector, deleting '/home/user/.local/share/Steam/userdata/881098149/803050/remotecache.vdf'

==> ./configstore_log.txt <==
[2024-06-25 22:11:33] Flushed store 'install' to '/home/user/.local/share/Steam/config/config.vdf'
[2024-06-25 22:11:33] Flushed store 'userlocal' to '/home/user/.local/share/Steam/userdata/881098149/config/localconfig.vdf'

==> ./cloud_log.txt <==
[2024-06-25 22:11:33] [AppID 803050] Starting sync (eval,)
[2024-06-25 22:11:33] [AppID 803050] AutoCloud checking local state for user 881098149
[2024-06-25 22:11:33] [AppID 803050] AutoCloud detected incomplete sync after previous run
[2024-06-25 22:11:33] [AppID 803050] Running AutoCloud on exit. Looking for new and updated files
[2024-06-25 22:11:33] [AppID 803050]     Evaluating rule 0 with root="GameInstall" path="SaveGames/" pattern="*.save" (recursive)
[2024-06-25 22:11:33] [AppID 803050]         Found 0 files that match /mnt/user/games/SteamLibrary/steamapps/common/Per Aspera/SaveGames/*.save
[2024-06-25 22:11:33] [AppID 803050]     No launch record found. Skipping looking for files while the game was running
[2024-06-25 22:11:33] [AppID 803050] AutoCloud complete
[2024-06-25 22:11:33] [AppID 803050] Need to sync from local change number '0' to global change number '0', but not attempting now
[2024-06-25 22:11:33] [AppID 803050] Eval complete
[2024-06-25 22:11:33] [AppID 803050] YldWriteCacheDirectoryToFile - empty vector, deleting '/home/user/.local/share/Steam/userdata/881098149/803050/remotecache.vdf'

==> ./configstore_log.txt <==
[2024-06-25 22:11:33] Flushed store 'userlocal' to '/home/user/.local/share/Steam/userdata/881098149/config/localconfig.vdf'

And this is the output from steam running from CLI:

steam.sh[9122]: Running Steam on manjarolinux 24.0.2 64-bit
steam.sh[9122]: STEAM_RUNTIME is enabled automatically
setup.sh[9196]: Steam runtime environment up-to-date!
steam.sh[9122]: Steam client's requirements are satisfied
[2024-06-25 22:10:51] Startup - updater built Jun 20 2024 17:13:49
[2024-06-25 22:10:51] Startup - Steam Client launched with: '/home/user/.local/share/Steam/ubuntu12_32/steam' '-srt-logger-opened'
06/25 22:10:51 minidumps folder is set to /tmp/dumps
06/25 22:10:51 Init: Installing breakpad exception handler for appid(steam)/version(1718904662)/tid(9249)
[2024-06-25 22:10:51] Loading cached metrics from disk (/home/user/.local/share/Steam/package/steam_client_metrics.bin)
[2024-06-25 22:10:51] Using the following download hosts for Public, Realm steamglobal
[2024-06-25 22:10:51] 1. https://client-update.akamai.steamstatic.com, /, Realm 'steamglobal', weight was 1000, source = 'update_hosts_cached.vdf'
[2024-06-25 22:10:51] 2. https://cdn.cloudflare.steamstatic.com, /client/, Realm 'steamglobal', weight was 1, source = 'update_hosts_cached.vdf'
[2024-06-25 22:10:51] 3. https://cdn.steamstatic.com, /client/, Realm 'steamglobal', weight was 1, source = 'baked in'
[2024-06-25 22:10:51] Verifying installation...
[2024-06-25 22:10:51] Verification complete
UpdateUI: skip show logo
Steam logging initialized: directory: /home/user/.local/share/Steam/logs

XRRGetOutputInfo Workaround: initialized with override: 0 real: 0xf0210370
XRRGetCrtcInfo Workaround: initialized with override: 0 real: 0xf020ecc0
/usr/share/themes/Breeze-Dark/gtk-2.0/widgets/entry:70: error: unexpected identifier 'direction', expected character '}'
/usr/share/themes/Breeze-Dark/gtk-2.0/widgets/styles:36: error: invalid string constant "combobox_entry", expected valid string constant
Fontconfig warning: line 5: unknown element "description"
Fontconfig warning: "/etc/fonts/conf.d/10-hinting-slight.conf", line 4: unknown element "description"
Fontconfig warning: "/etc/fonts/conf.d/10-scale-bitmap-fonts.conf", line 4: unknown element "description"
Fontconfig error: "/etc/fonts/conf.d/10-scale-bitmap-fonts.conf", line 72: non-double matrix element
Fontconfig error: "/etc/fonts/conf.d/10-scale-bitmap-fonts.conf", line 72: non-double matrix element
Fontconfig warning: "/etc/fonts/conf.d/10-scale-bitmap-fonts.conf", line 80: saw unknown, expected number
Fontconfig warning: "/etc/fonts/conf.d/10-sub-pixel-rgb.conf", line 4: unknown element "description"
Fontconfig warning: "/etc/fonts/conf.d/10-yes-antialias.conf", line 4: unknown element "description"
Fontconfig warning: "/etc/fonts/conf.d/11-lcdfilter-default.conf", line 4: unknown element "description"
Fontconfig warning: "/etc/fonts/conf.d/20-unhint-small-vera.conf", line 4: unknown element "description"
Fontconfig warning: "/etc/fonts/conf.d/30-metric-aliases.conf", line 4: unknown element "description"
Fontconfig warning: "/etc/fonts/conf.d/40-nonlatin.conf", line 4: unknown element "description"
Fontconfig warning: "/etc/fonts/conf.d/45-generic.conf", line 4: unknown element "description"
Fontconfig warning: "/etc/fonts/conf.d/45-latin.conf", line 4: unknown element "description"
Fontconfig warning: "/etc/fonts/conf.d/48-spacing.conf", line 4: unknown element "description"
Fontconfig warning: "/etc/fonts/conf.d/49-sansserif.conf", line 4: unknown element "description"
Fontconfig warning: "/etc/fonts/conf.d/50-user.conf", line 4: unknown element "description"
Fontconfig warning: "/etc/fonts/conf.d/51-local.conf", line 4: unknown element "description"
Fontconfig warning: "/etc/fonts/conf.d/60-generic.conf", line 4: unknown element "description"
Fontconfig warning: "/etc/fonts/conf.d/60-latin.conf", line 4: unknown element "description"
Fontconfig warning: "/etc/fonts/conf.d/65-nonlatin.conf", line 4: unknown element "description"
CAppInfoCacheReadFromDiskThread took 40 milliseconds to initialize
Steam Runtime Launch Service: starting steam-runtime-launcher-service
Steam Runtime Launch Service: steam-runtime-launcher-service is running pid 9351
bus_name=com.steampowered.PressureVessel.LaunchAlongsideSteam
BRefreshApplicationsInLibrary 1: 199ms
BuildCompleteAppOverviewChange: 142 apps
RegisterForAppOverview 1: 11ms
RegisterForAppOverview 2: 11ms
chdir "/mnt/user/games/SteamLibrary/steamapps/common/Per Aspera"
ERROR: ld.so: object '/home/user/.local/share/Steam/ubuntu12_32/gameoverlayrenderer.so' from LD_PRELOAD cannot be preloaded (wrong ELF class: ELFCLASS32): ignored.
ERROR: ld.so: object '/home/user/.local/share/Steam/ubuntu12_32/gameoverlayrenderer.so' from LD_PRELOAD cannot be preloaded (wrong ELF class: ELFCLASS32): ignored.
ERROR: ld.so: object '/home/user/.local/share/Steam/ubuntu12_32/gameoverlayrenderer.so' from LD_PRELOAD cannot be preloaded (wrong ELF class: ELFCLASS32): ignored.
Adding process 9616 for gameID 803050
ERROR: ld.so: object 'libgamemodeauto.so.0' from LD_PRELOAD cannot be preloaded (wrong ELF class: ELFCLASS64): ignored.
ERROR: ld.so: object '/home/user/.local/share/Steam/ubuntu12_64/gameoverlayrenderer.so' from LD_PRELOAD cannot be preloaded (wrong ELF class: ELFCLASS64): ignored.
ERROR: ld.so: object '/home/user/.local/share/Steam/ubuntu12_32/gameoverlayrenderer.so' from LD_PRELOAD cannot be preloaded (wrong ELF class: ELFCLASS32): ignored.
Adding process 9630 for gameID 803050
Uploaded AppInterfaceStats to Steam
Removing process 9630 for gameID 803050
Removing process 9616 for gameID 803050
[2024-06-25 22:12:14] Shutdown

And these are some error logs from earlier:

content_log.txt:[2024-06-25 21:44:58] AppID 526870 scheduler finished : staying in schedule (result No Error, state 0xc) 
content_log.txt:[2024-06-25 21:45:15] AppID 526870 scheduler finished : staying in schedule (result No Error, state 0xc) 
content_log.txt:[2024-06-25 21:45:19] AppID 526870 scheduler finished : removed from schedule (result No Error, state 0xc)

stats_log.txt:[2024-06-25 21:08:47] [AppID 1245040] CAPIJobRequestUserStats - received error 'Failure' (2) from server
stats_log.txt:[2024-06-25 21:44:55] [AppID 526870] CAPIJobRequestUserStats - received error 'Failure' (2) from server
stats_log.txt:[2024-06-25 21:51:46] [AppID 526870] CAPIJobRequestUserStats - received error 'Failure' (2) from server

console-linux.txt:/usr/share/themes/Breeze-Dark/gtk-2.0/widgets/styles:36: error: invalid string constant "combobox_entry", expected valid string constant
console-linux.txt:Fontconfig error: "/etc/fonts/conf.d/10-scale-bitmap-fonts.conf", line 72: non-double matrix element
console-linux.txt:Fontconfig error: "/etc/fonts/conf.d/10-scale-bitmap-fonts.conf", line 72: non-double matrix element
console-linux.txt:ERROR: ld.so: object '/home/user/.local/share/Steam/ubuntu12_32/gameoverlayrenderer.so' from LD_PRELOAD cannot be preloaded (wrong ELF class: ELFCLASS32): ignored.
console-linux.txt:ERROR: ld.so: object '/home/user/.local/share/Steam/ubuntu12_32/gameoverlayrenderer.so' from LD_PRELOAD cannot be preloaded (wrong ELF class: ELFCLASS32): ignored.
console-linux.txt:ERROR: ld.so: object '/home/user/.local/share/Steam/ubuntu12_32/gameoverlayrenderer.so' from LD_PRELOAD cannot be preloaded (wrong ELF class: ELFCLASS32): ignored.
console-linux.txt:ERROR: ld.so: object 'libgamemodeauto.so.0' from LD_PRELOAD cannot be preloaded (wrong ELF class: ELFCLASS64): ignored.
console-linux.txt:ERROR: ld.so: object '/home/user/.local/share/Steam/ubuntu12_64/gameoverlayrenderer.so' from LD_PRELOAD cannot be preloaded (wrong ELF class: ELFCLASS64): ignored.
console-linux.txt:ERROR: ld.so: object '/home/user/.local/share/Steam/ubuntu12_32/gameoverlayrenderer.so' from LD_PRELOAD cannot be preloaded (wrong ELF class: ELFCLASS32): ignored.

cef_log.previous.txt:[0625/220121.796574:ERROR:angle_platform_impl.cc(43)] Display.cpp:1021 (initialize): ANGLE Display::initialize error 0: Internal Vulkan error (-3): Initialization of an object could not be 
completed for implementation-specific reasons, in ../../third_party/angle/src/libANGLE/renderer/vulkan/RendererVk.cpp, initialize:1404.
cef_log.previous.txt:[0625/220121.796651:ERROR:gl_display.cc(508)] EGL Driver message (Critical) eglInitialize: Internal Vulkan error (-3): Initialization of an object could not be completed for implementation-
specific reasons, in ../../third_party/angle/src/libANGLE/renderer/vulkan/RendererVk.cpp, initialize:1404.
cef_log.previous.txt:[0625/220121.796691:ERROR:gl_display.cc(932)] eglInitialize SwANGLE failed with error EGL_NOT_INITIALIZED
cef_log.previous.txt:[0625/220121.796730:ERROR:gl_ozone_egl.cc(23)] GLDisplayEGL::Initialize failed.
cef_log.previous.txt:[0625/220121.798203:ERROR:viz_main_impl.cc(186)] Exiting GPU process due to errors during initialization
cef_log.previous.txt:[0625/220121.843278:ERROR:angle_platform_impl.cc(43)] Display.cpp:1021 (initialize): ANGLE Display::initialize error 0: Internal Vulkan error (-3): Initialization of an object could not be 
completed for implementation-specific reasons, in ../../third_party/angle/src/libANGLE/renderer/vulkan/RendererVk.cpp, initialize:1404.
cef_log.previous.txt:[0625/220121.843353:ERROR:gl_display.cc(508)] EGL Driver message (Critical) eglInitialize: Internal Vulkan error (-3): Initialization of an object could not be completed for implementation-
specific reasons, in ../../third_party/angle/src/libANGLE/renderer/vulkan/RendererVk.cpp, initialize:1404.
cef_log.previous.txt:[0625/220121.843389:ERROR:gl_display.cc(932)] eglInitialize SwANGLE failed with error EGL_NOT_INITIALIZED
cef_log.previous.txt:[0625/220121.843427:ERROR:gl_ozone_egl.cc(23)] GLDisplayEGL::Initialize failed.
cef_log.previous.txt:[0625/220121.845640:ERROR:viz_main_impl.cc(186)] Exiting GPU process due to errors during initialization
cef_log.previous.txt:[0625/220121.852963:ERROR:gpu_init.cc(523)] Passthrough is not supported, GL is disabled, ANGLE is 
cef_log.previous.txt:[0625/221042.057148:WARNING:connection.cc(41)] X error received.  Request: Shm::PutImageRequest, Error: DrawableError{.sequence = 1231, .bad_value = 85983329, .minor_opcode = 3, .major_opcode = 130}
cef_log.previous.txt:[0625/221042.070183:WARNING:connection.cc(41)] X error received.  Request: SendEventRequest, Error: WindowError{.sequence = 8944, .bad_value = 85983256, .minor_opcode = 0, .major_opcode = 25}
cef_log.previous.txt:[0625/221042.070783:WARNING:connection.cc(41)] X error received.  Request: SendEventRequest, Error: WindowError{.sequence = 8946, .bad_value = 85983247, .minor_opcode = 0, .major_opcode = 25}
cef_log.previous.txt:[0625/221042.071553:WARNING:connection.cc(41)] X error received.  Request: SendEventRequest, Error: WindowError{.sequence = 8948, .bad_value = 85983260, .minor_opcode = 0, .major_opcode = 25}
cef_log.previous.txt:[0625/221042.071965:WARNING:connection.cc(41)] X error received.  Request: SendEventRequest, Error: WindowError{.sequence = 8950, .bad_value = 85983264, .minor_opcode = 0, .major_opcode = 25}
cef_log.previous.txt:[0625/221042.071954:WARNING:connection.cc(41)] X error received.  Request: Shm::PutImageRequest, Error: DrawableError{.sequence = 1235, .bad_value = 85983266, .minor_opcode = 3, .major_opcode = 130}
cef_log.previous.txt:[0625/221042.072240:WARNING:connection.cc(41)] X error received.  Request: SendEventRequest, Error: WindowError{.sequence = 8952, .bad_value = 85983268, .minor_opcode = 0, .major_opcode = 25}
cef_log.previous.txt:[0625/221042.072608:WARNING:connection.cc(41)] X error received.  Request: SendEventRequest, Error: WindowError{.sequence = 8954, .bad_value = 85983272, .minor_opcode = 0, .major_opcode = 25}
cef_log.previous.txt:[0625/221042.072844:WARNING:connection.cc(41)] X error received.  Request: SendEventRequest, Error: WindowError{.sequence = 8956, .bad_value = 85983276, .minor_opcode = 0, .major_opcode = 25}
cef_log.previous.txt:[0625/221042.073102:WARNING:connection.cc(41)] X error received.  Request: SendEventRequest, Error: WindowError{.sequence = 8958, .bad_value = 85983280, .minor_opcode = 0, .major_opcode = 25}
cef_log.previous.txt:[0625/221042.073697:WARNING:connection.cc(41)] X error received.  Request: SendEventRequest, Error: WindowError{.sequence = 8960, .bad_value = 85983284, .minor_opcode = 0, .major_opcode = 25}
cef_log.previous.txt:[0625/221042.074076:WARNING:connection.cc(41)] X error received.  Request: SendEventRequest, Error: WindowError{.sequence = 8962, .bad_value = 85983288, .minor_opcode = 0, .major_opcode = 25}
cef_log.previous.txt:[0625/221042.074528:WARNING:connection.cc(41)] X error received.  Request: SendEventRequest, Error: WindowError{.sequence = 8964, .bad_value = 85983292, .minor_opcode = 0, .major_opcode = 25}
cef_log.previous.txt:[0625/221042.074776:WARNING:connection.cc(41)] X error received.  Request: SendEventRequest, Error: WindowError{.sequence = 8966, .bad_value = 85983296, .minor_opcode = 0, .major_opcode = 25}
cef_log.previous.txt:[0625/221042.075040:WARNING:connection.cc(41)] X error received.  Request: SendEventRequest, Error: WindowError{.sequence = 8968, .bad_value = 85983327, .minor_opcode = 0, .major_opcode = 25}

steamwebhelper.log:[0610/224401.337079:ERROR:context.cc(100)] The browser_subprocess_path directory (./steamwebhelper) is not an absolute path. Defaulting to empty.
steamwebhelper.log:[0610/224401.847123:ERROR:angle_platform_impl.cc(43)] Display.cpp:1021 (initialize): ANGLE Display::initialize error 0: Internal Vulkan error (-3): Initialization of an object could not be co
mpleted for implementation-specific reasons, in ../../third_party/angle/src/libANGLE/renderer/vulkan/RendererVk.cpp, initialize:1404.
steamwebhelper.log:ERR: Display.cpp:1021 (initialize): ANGLE Display::initialize error 0: Internal Vulkan error (-3): Initialization of an object could not be completed for implementation-specific reasons, in .
./../third_party/angle/src/libANGLE/renderer/vulkan/RendererVk.cpp, initialize:1404.
steamwebhelper.log:[0610/224401.847212:ERROR:gl_display.cc(508)] EGL Driver message (Critical) eglInitialize: Internal Vulkan error (-3): Initialization of an object could not be completed for implementation-specific reasons, in ../../third_party/angle/src/libANGLE/renderer/vulkan/RendererVk.cpp, initialize:1404.
steamwebhelper.log:[0610/224401.847428:ERROR:gl_display.cc(932)] eglInitialize SwANGLE failed with error EGL_NOT_INITIALIZED
steamwebhelper.log:[0610/224401.847612:ERROR:gl_ozone_egl.cc(23)] GLDisplayEGL::Initialize failed.
steamwebhelper.log:[0610/224401.849772:ERROR:viz_main_impl.cc(186)] Exiting GPU process due to errors during initialization
steamwebhelper.log:[0610/224401.917382:ERROR:angle_platform_impl.cc(43)] Display.cpp:1021 (initialize): ANGLE Display::initialize error 0: Internal Vulkan error (-3): Initialization of an object could not be completed for implementation-specific reasons, in ../../third_party/angle/src/libANGLE/renderer/vulkan/RendererVk.cpp, initialize:1404.
steamwebhelper.log:ERR: Display.cpp:1021 (initialize): ANGLE Display::initialize error 0: Internal Vulkan error (-3): Initialization of an object could not be completed for implementation-specific reasons, in ../../third_party/angle/src/libANGLE/renderer/vulkan/RendererVk.cpp, initialize:1404.
steamwebhelper.log:[0610/224401.917463:ERROR:gl_display.cc(508)] EGL Driver message (Critical) eglInitialize: Internal Vulkan error (-3): Initialization of an object could not be completed for implementation-specific reasons, in ../../third_party/angle/src/libANGLE/renderer/vulkan/RendererVk.cpp, initialize:1404.
steamwebhelper.log:[0610/224401.917503:ERROR:gl_display.cc(932)] eglInitialize SwANGLE failed with error EGL_NOT_INITIALIZED
steamwebhelper.log:[0610/224401.917544:ERROR:gl_ozone_egl.cc(23)] GLDisplayEGL::Initialize failed.
steamwebhelper.log:[0610/224401.921630:ERROR:viz_main_impl.cc(186)] Exiting GPU process due to errors during initialization
steamwebhelper.log:[0610/224402.110960:ERROR:gpu_init.cc(523)] Passthrough is not supported, GL is disabled, ANGLE is 
steamwebhelper.log:[0610/224407.195954:INFO:CONSOLE(0)] "Uncaught (in promise) AbortError: The play() request was interrupted because video-only background media was paused to save power. https://goo.gl/LdLk22", source: https://store.steampowered.com/ (0)
steamwebhelper.log:[0610/224407.196002:INFO:CONSOLE(0)] "Uncaught (in promise) AbortError: The play() request was interrupted because video-only background media was paused to save power. https://goo.gl/LdLk22", source: https://store.steampowered.com/ (0)
steamwebhelper.log:[0610/224822.310839:WARNING:connection.cc(41)] X error received.  Request: Shm::PutImageRequest, Error: DrawableError{.sequence = 14794, .bad_value = 123732080, .minor_opcode = 3, .major_opcode = 130}
steamwebhelper.log:[0610/230207.400860:ERROR:connection.cc(46)] X connection error received.
steamwebhelper.log:[0610/230207.401864:ERROR:connection.cc(46)] X connection error received.

console_log.txt:[2024-06-25 21:53:22] X Error of failed request:  BadWindow (invalid Window parameter)
console_log.txt:[2024-06-25 21:53:22] xerror_handler: X failed, continuing

webhelper.txt:[2024-06-25 22:12:13] Webhelper: An X Error occurred
webhelper.txt:[2024-06-25 22:12:13] X Error of failed request:  BadWindow (invalid Window parameter)

cef_log.txt:[0625/221053.445105:ERROR:angle_platform_impl.cc(43)] Display.cpp:1021 (initialize): ANGLE Display::initialize error 0: Internal Vulkan error (-3): Initialization of an object could not be completed
 for implementation-specific reasons, in ../../third_party/angle/src/libANGLE/renderer/vulkan/RendererVk.cpp, initialize:1404.
cef_log.txt:[0625/221053.445189:ERROR:gl_display.cc(508)] EGL Driver message (Critical) eglInitialize: Internal Vulkan error (-3): Initialization of an object could not be completed for implementation-specific 
reasons, in ../../third_party/angle/src/libANGLE/renderer/vulkan/RendererVk.cpp, initialize:1404.
cef_log.txt:[0625/221053.445234:ERROR:gl_display.cc(932)] eglInitialize SwANGLE failed with error EGL_NOT_INITIALIZED
cef_log.txt:[0625/221053.445272:ERROR:gl_ozone_egl.cc(23)] GLDisplayEGL::Initialize failed.
cef_log.txt:[0625/221053.446644:ERROR:viz_main_impl.cc(186)] Exiting GPU process due to errors during initialization
cef_log.txt:[0625/221053.494576:ERROR:angle_platform_impl.cc(43)] Display.cpp:1021 (initialize): ANGLE Display::initialize error 0: Internal Vulkan error (-3): Initialization of an object could not be completed
 for implementation-specific reasons, in ../../third_party/angle/src/libANGLE/renderer/vulkan/RendererVk.cpp, initialize:1404.
cef_log.txt:[0625/221053.494710:ERROR:gl_display.cc(508)] EGL Driver message (Critical) eglInitialize: Internal Vulkan error (-3): Initialization of an object could not be completed for implementation-specific 
reasons, in ../../third_party/angle/src/libANGLE/renderer/vulkan/RendererVk.cpp, initialize:1404.
cef_log.txt:[0625/221053.494769:ERROR:gl_display.cc(932)] eglInitialize SwANGLE failed with error EGL_NOT_INITIALIZED
cef_log.txt:[0625/221053.494846:ERROR:gl_ozone_egl.cc(23)] GLDisplayEGL::Initialize failed.
cef_log.txt:[0625/221053.497992:ERROR:viz_main_impl.cc(186)] Exiting GPU process due to errors during initialization
cef_log.txt:[0625/221053.505408:ERROR:gpu_init.cc(523)] Passthrough is not supported, GL is disabled, ANGLE is 
cef_log.txt:[0625/221213.301956:WARNING:connection.cc(41)] X error received.  Request: Shm::PutImageRequest, Error: DrawableError{.sequence = 897, .bad_value = 90177620, .minor_opcode = 3, .major_opcode = 130}
cef_log.txt:[0625/221213.316970:WARNING:connection.cc(41)] X error received.  Request: SendEventRequest, Error: WindowError{.sequence = 3983, .bad_value = 90177560, .minor_opcode = 0, .major_opcode = 25}
cef_log.txt:[0625/221213.317249:WARNING:connection.cc(41)] X error received.  Request: SendEventRequest, Error: WindowError{.sequence = 3985, .bad_value = 90177556, .minor_opcode = 0, .major_opcode = 25}
cef_log.txt:[0625/221213.317564:WARNING:connection.cc(41)] X error received.  Request: SendEventRequest, Error: WindowError{.sequence = 3987, .bad_value = 90177564, .minor_opcode = 0, .major_opcode = 25}
cef_log.txt:[0625/221213.317827:WARNING:connection.cc(41)] X error received.  Request: SendEventRequest, Error: WindowError{.sequence = 3989, .bad_value = 90177568, .minor_opcode = 0, .major_opcode = 25}
cef_log.txt:[0625/221213.318236:WARNING:connection.cc(41)] X error received.  Request: SendEventRequest, Error: WindowError{.sequence = 3991, .bad_value = 90177572, .minor_opcode = 0, .major_opcode = 25}
cef_log.txt:[0625/221213.318312:WARNING:connection.cc(41)] X error received.  Request: Shm::PutImageRequest, Error: DrawableError{.sequence = 901, .bad_value = 90177570, .minor_opcode = 3, .major_opcode = 130}
cef_log.txt:[0625/221213.318558:WARNING:connection.cc(41)] X error received.  Request: SendEventRequest, Error: WindowError{.sequence = 3993, .bad_value = 90177576, .minor_opcode = 0, .major_opcode = 25}
cef_log.txt:[0625/221213.318914:WARNING:connection.cc(41)] X error received.  Request: SendEventRequest, Error: WindowError{.sequence = 3995, .bad_value = 90177580, .minor_opcode = 0, .major_opcode = 25}
cef_log.txt:[0625/221213.319135:WARNING:connection.cc(41)] X error received.  Request: SendEventRequest, Error: WindowError{.sequence = 3997, .bad_value = 90177584, .minor_opcode = 0, .major_opcode = 25}
cef_log.txt:[0625/221213.319365:WARNING:connection.cc(41)] X error received.  Request: SendEventRequest, Error: WindowError{.sequence = 3999, .bad_value = 90177588, .minor_opcode = 0, .major_opcode = 25}
cef_log.txt:[0625/221213.319598:WARNING:connection.cc(41)] X error received.  Request: SendEventRequest, Error: WindowError{.sequence = 4001, .bad_value = 90177592, .minor_opcode = 0, .major_opcode = 25}
cef_log.txt:[0625/221213.319912:WARNING:connection.cc(41)] X error received.  Request: SendEventRequest, Error: WindowError{.sequence = 4003, .bad_value = 90177596, .minor_opcode = 0, .major_opcode = 25}
cef_log.txt:[0625/221213.320217:WARNING:connection.cc(41)] X error received.  Request: SendEventRequest, Error: WindowError{.sequence = 4005, .bad_value = 90177600, .minor_opcode = 0, .major_opcode = 25}
cef_log.txt:[0625/221213.320782:WARNING:connection.cc(41)] X error received.  Request: SendEventRequest, Error: WindowError{.sequence = 4007, .bad_value = 90177618, .minor_opcode = 0, .major_opcode = 25}
cef_log.txt:[0625/221213.338398:WARNING:connection.cc(41)] X error received.  Request: Shm::PutImageRequest, Error: DrawableError{.sequence = 902, .bad_value = 90177558, .minor_opcode = 3, .major_opcode = 130}
cef_log.txt:[0625/221213.339541:WARNING:connection.cc(41)] X error received.  Request: Shm::PutImageRequest, Error: DrawableError{.sequence = 903, .bad_value = 90177620, .minor_opcode = 3, .major_opcode = 130}

webhelper-linux.txt:[0625/221053.141338:ERROR:context.cc(100)] The browser_subprocess_path directory (./steamwebhelper) is not an absolute path. Defaulting to empty.
webhelper-linux.txt:[0625/221053.445105:ERROR:angle_platform_impl.cc(43)] Display.cpp:1021 (initialize): ANGLE Display::initialize error 0: Internal Vulkan error (-3): Initialization of an object could not be c
ompleted for implementation-specific reasons, in ../../third_party/angle/src/libANGLE/renderer/vulkan/RendererVk.cpp, initialize:1404.
webhelper-linux.txt:ERR: Display.cpp:1021 (initialize): ANGLE Display::initialize error 0: Internal Vulkan error (-3): Initialization of an object could not be completed for implementation-specific reasons, in 
../../third_party/angle/src/libANGLE/renderer/vulkan/RendererVk.cpp, initialize:1404.
webhelper-linux.txt:[0625/221053.445189:ERROR:gl_display.cc(508)] EGL Driver message (Critical) eglInitialize: Internal Vulkan error (-3): Initialization of an object could not be completed for implementation-specific reasons, in ../../third_party/angle/src/libANGLE/renderer/vulkan/RendererVk.cpp, initialize:1404.
webhelper-linux.txt:[0625/221053.445234:ERROR:gl_display.cc(932)] eglInitialize SwANGLE failed with error EGL_NOT_INITIALIZED
webhelper-linux.txt:[0625/221053.445272:ERROR:gl_ozone_egl.cc(23)] GLDisplayEGL::Initialize failed.
webhelper-linux.txt:[0625/221053.446644:ERROR:viz_main_impl.cc(186)] Exiting GPU process due to errors during initialization
webhelper-linux.txt:[0625/221053.494576:ERROR:angle_platform_impl.cc(43)] Display.cpp:1021 (initialize): ANGLE Display::initialize error 0: Internal Vulkan error (-3): Initialization of an object could not be completed for implementation-specific reasons, in ../../third_party/angle/src/libANGLE/renderer/vulkan/RendererVk.cpp, initialize:1404.
webhelper-linux.txt:ERR: Display.cpp:1021 (initialize): ANGLE Display::initialize error 0: Internal Vulkan error (-3): Initialization of an object could not be completed for implementation-specific reasons, in ../../third_party/angle/src/libANGLE/renderer/vulkan/RendererVk.cpp, initialize:1404.
webhelper-linux.txt:[0625/221053.494710:ERROR:gl_display.cc(508)] EGL Driver message (Critical) eglInitialize: Internal Vulkan error (-3): Initialization of an object could not be completed for implementation-specific reasons, in ../../third_party/angle/src/libANGLE/renderer/vulkan/RendererVk.cpp, initialize:1404.
webhelper-linux.txt:[0625/221053.494769:ERROR:gl_display.cc(932)] eglInitialize SwANGLE failed with error EGL_NOT_INITIALIZED
webhelper-linux.txt:[0625/221053.494846:ERROR:gl_ozone_egl.cc(23)] GLDisplayEGL::Initialize failed.
webhelper-linux.txt:[0625/221053.497992:ERROR:viz_main_impl.cc(186)] Exiting GPU process due to errors during initialization
webhelper-linux.txt:[0625/221053.505408:ERROR:gpu_init.cc(523)] Passthrough is not supported, GL is disabled, ANGLE is 
webhelper-linux.txt:[0625/221213.301956:WARNING:connection.cc(41)] X error received.  Request: Shm::PutImageRequest, Error: DrawableError{.sequence = 897, .bad_value = 90177620, .minor_opcode = 3, .major_opcode = 130}
webhelper-linux.txt:[0625/221213.316970:WARNING:connection.cc(41)] X error received.  Request: SendEventRequest, Error: WindowError{.sequence = 3983, .bad_value = 90177560, .minor_opcode = 0, .major_opcode = 25}

Anyone has any ideas or thoughts about what to do?

Please update your topic title and first post with the name of the game.

Please also see the pinned topic in the Gaming category:

Running different games with different proton versions has the same behavior.

I hopefully made it a bit clearer with the title and adding plural. I cant get any game to run.

Also ran out of tips and tricks, unless there is something specific that I have looked over and misread.

What i miss from your viewpoint, when was the last time you could play without issues on Manjaro?

And what changes did you make after the last time?

Shoot in the blue: switch between X11 and Wayland maybe helps.
You can switch in Login Menue from KDE (Bottom Left).

All the logs you’ve posted seem to be trying to run games from partitions mounted in /mnt. If those partitions are NTFS then you need to set correct the mount options.

1 Like

@Kobold

What i miss from your viewpoint, when was the last time you could play without issues on Manjaro?

Never. This is a fresh installed Manjaro. It has been running windows before then.

Shoot in the blue: switch between X11 and Wayland maybe helps.
You can switch in Login Menue from KDE (Bottom Left).

Thank you for the idea, tried it now but this did not change the behavior.
Got more logs though, but they are repeating the same errors as already written.

@MrLavender

All the logs you’ve posted seem to be trying to run games from partitions mounted in /mnt . If those partitions are NTFS then you need to set correct the mount options.

Yes, NTFS did pose some troubles put it seems I have gone through them. Either way, I also have installed games on a ext4 filesystem. Running from either filesystem as well as from the root partition returns the same problem.

Can’t see it making a difference but does steam flatpak have same issues? If it doesn’t then it’s a dependency issue somewhere but i never managed to get any NTFS games to play myself so just gave up and reinstalled them.

Also you could try launching the games with lutris which will give you more launch options and logs

Okay that’s interesting, because you had this installed:

And this is a really old Legacy Nvidia driver, i only had nvidia legacy 470xx package installed on my system from my 2020 install, so i thought your installation must be older than mine :thinking:

So did you downloaded the newest Manjaro ISO (Full) and Steam was pre-installed (official repo)?

Any additional errors? with:

systemctl --failed

journalctl -p 3 -xb

I think you better should install your games in your Home Partition or a extra Partition… I never installed and executes games from Root… possible im wrong here, but i think Root isnt the right Partition.

Maybe few points from my Linux Gamer Guide could help you, that you missed with your installation:

Finally been able to sit down and spend time on the computer again so here goes :slight_smile:

@sawdoctor

It worked running from flatpak. I did not try every game, but a game worked, first try, nothing special at all. So apparently there is a dependency issue. Any idea of what/how/which I can find this out and fix? Including the output from flatpak below.

Flaptak run output
flatpak run com.valvesoftware.Steam                                                                                                                                                                ✔ 
INFO:root:https://github.com/flathub/com.valvesoftware.Steam/wiki
INFO:root:Will set XDG dirs prefix to /home/user/.var/app/com.valvesoftware.Steam
DEBUG:root:Checking input devices permissions
INFO:root:Overriding TZ to Europe/Stockholm
steam.sh[2]: Running Steam on org.freedesktop.platform 23.08 64-bit
steam.sh[2]: STEAM_RUNTIME is enabled automatically
setup.sh[75]: Steam runtime environment up-to-date!
steam.sh[2]: Steam client's requirements are satisfied
[2024-07-13 20:12:51] Startup - updater built Jun 20 2024 17:13:49
[2024-07-13 20:12:51] Startup - Steam Client launched with: '/home/user/.var/app/com.valvesoftware.Steam/.local/share/Steam/ubuntu12_32/steam' '-srt-logger-opened' '-no-cef-sandbox'
07/13 20:12:51 minidumps folder is set to /tmp/dumps
07/13 20:12:51 Init: Installing breakpad exception handler for appid(steam)/version(1718904662)/tid(135)
[2024-07-13 20:12:51] Loading cached metrics from disk (/home/user/.var/app/com.valvesoftware.Steam/.local/share/Steam/package/steam_client_metrics.bin)
[2024-07-13 20:12:51] Using the following download hosts for Public, Realm steamglobal
[2024-07-13 20:12:51] 1. https://client-update.akamai.steamstatic.com, /, Realm 'steamglobal', weight was 1000, source = 'update_hosts_cached.vdf'
[2024-07-13 20:12:51] 2. https://cdn.cloudflare.steamstatic.com, /client/, Realm 'steamglobal', weight was 1, source = 'update_hosts_cached.vdf'
[2024-07-13 20:12:51] 3. https://cdn.steamstatic.com, /client/, Realm 'steamglobal', weight was 1, source = 'baked in'
[2024-07-13 20:12:51] Verifying installation...
[2024-07-13 20:12:51] Verification complete
UpdateUI: skip show logo
Steam logging initialized: directory: /home/user/.var/app/com.valvesoftware.Steam/.local/share/Steam/logs

XRRGetOutputInfo Workaround: initialized with override: 0 real: 0xf04a68f0
XRRGetCrtcInfo Workaround: initialized with override: 0 real: 0xf04a51c0
CAppInfoCacheReadFromDiskThread took 41 milliseconds to initialize
Steam Runtime Launch Service: starting steam-runtime-launcher-service
Steam Runtime Launch Service: steam-runtime-launcher-service is running pid 219
bus_name=com.steampowered.PressureVessel.LaunchAlongsideSteam
DRM kernel driver 'nvidia-drm' in use. NVK requires nouveau.
DRM kernel driver 'nvidia-drm' in use. NVK requires nouveau.
BRefreshApplicationsInLibrary 1: 1ms
BuildCompleteAppOverviewChange: 142 apps
RegisterForAppOverview 1: 5ms
RegisterForAppOverview 2: 5ms
Couldn't write /etc/ld.so.conf/.steam_exec_test.sh: Not a directory
sh: rad 1: /mnt/user/SteamEpicGames/.steam_exec_test.sh: Åtkomst nekas
Failed system("/mnt/user/SteamEpicGames/.steam_exec_test.sh") in execute test: 32256
sh: rad 1: /mnt/user/DATA/.steam_exec_test.sh: Åtkomst nekas
Failed system("/mnt/user/DATA/.steam_exec_test.sh") in execute test: 32256
sh: rad 1: /mnt/user/SteamEpicGames/SteamLibrary/.steam_exec_test.sh: Åtkomst nekas
Failed system("/mnt/user/SteamEpicGames/SteamLibrary/.steam_exec_test.sh") in execute test: 32256
Couldn't write /etc/ld.so.conf/.steam_exec_test.sh: Not a directory
sh: rad 1: /mnt/user/SteamEpicGames/.steam_exec_test.sh: Åtkomst nekas
Failed system("/mnt/user/SteamEpicGames/.steam_exec_test.sh") in execute test: 32256
sh: rad 1: /mnt/user/DATA/.steam_exec_test.sh: Åtkomst nekas
Failed system("/mnt/user/DATA/.steam_exec_test.sh") in execute test: 32256
sh: rad 1: /mnt/user/SteamEpicGames/SteamLibrary/.steam_exec_test.sh: Åtkomst nekas
Failed system("/mnt/user/SteamEpicGames/SteamLibrary/.steam_exec_test.sh") in execute test: 32256
sh: rad 1: /mnt/user/SteamEpicGames/SteamLibrary/.steam_exec_test.sh: Åtkomst nekas
Failed system("/mnt/user/SteamEpicGames/SteamLibrary/.steam_exec_test.sh") in execute test: 32256
BuildCompleteAppOverviewChange: 142 apps
[2024-07-13 20:14:29] Shutdown
steam.sh[2]: Restarting Steam by request...
steam.sh[2]: Running Steam on org.freedesktop.platform 23.08 64-bit
steam.sh[2]: STEAM_RUNTIME has been set by the user to: /home/user/.var/app/com.valvesoftware.Steam/.local/share/Steam/ubuntu12_32/steam-runtime
setup.sh[698]: Steam runtime environment up-to-date!
steam.sh[2]: Log already open
steam.sh[2]: Steam client's requirements are satisfied
[2024-07-13 20:14:31] Startup - updater built Jun 20 2024 17:13:49
[2024-07-13 20:14:31] Startup - Steam Client launched with: '/home/user/.var/app/com.valvesoftware.Steam/.local/share/Steam/ubuntu12_32/steam' '-srt-logger-opened' '-no-cef-sandbox'
07/13 20:14:31 minidumps folder is set to /tmp/dumps
07/13 20:14:31 Init: Installing breakpad exception handler for appid(steam)/version(1718904662)/tid(755)
[2024-07-13 20:14:31] Loading cached metrics from disk (/home/user/.var/app/com.valvesoftware.Steam/.local/share/Steam/package/steam_client_metrics.bin)
[2024-07-13 20:14:31] Using the following download hosts for Public, Realm steamglobal
[2024-07-13 20:14:31] 1. https://client-update.akamai.steamstatic.com, /, Realm 'steamglobal', weight was 1000, source = 'update_hosts_cached.vdf'
[2024-07-13 20:14:31] 2. https://cdn.cloudflare.steamstatic.com, /client/, Realm 'steamglobal', weight was 1, source = 'update_hosts_cached.vdf'
[2024-07-13 20:14:31] 3. https://cdn.steamstatic.com, /client/, Realm 'steamglobal', weight was 1, source = 'baked in'
[2024-07-13 20:14:31] Verifying installation...
[2024-07-13 20:14:31] Verification complete
UpdateUI: skip show logo
Steam logging initialized: directory: /home/user/.var/app/com.valvesoftware.Steam/.local/share/Steam/logs

XRRGetOutputInfo Workaround: initialized with override: 0 real: 0xf04648f0
XRRGetCrtcInfo Workaround: initialized with override: 0 real: 0xf04631c0
CAppInfoCacheReadFromDiskThread took 51 milliseconds to initialize
Steam Runtime Launch Service: starting steam-runtime-launcher-service
Steam Runtime Launch Service: steam-runtime-launcher-service is running pid 850
bus_name=com.steampowered.PressureVessel.LaunchAlongsideSteam
DRM kernel driver 'nvidia-drm' in use. NVK requires nouveau.
DRM kernel driver 'nvidia-drm' in use. NVK requires nouveau.
BRefreshApplicationsInLibrary 1: 0ms
BuildCompleteAppOverviewChange: 142 apps
RegisterForAppOverview 1: 14ms
RegisterForAppOverview 2: 15ms
chdir "/mnt/user/games/SteamLibrary/steamapps/common/We Were Here"
ERROR: ld.so: object '/home/user/.var/app/com.valvesoftware.Steam/.local/share/Steam/ubuntu12_32/gameoverlayrenderer.so' from LD_PRELOAD cannot be preloaded (wrong ELF class: ELFCLASS32): ignored.
ERROR: ld.so: object '/home/user/.var/app/com.valvesoftware.Steam/.local/share/Steam/ubuntu12_64/gameoverlayrenderer.so' from LD_PRELOAD cannot be preloaded (wrong ELF class: ELFCLASS64): ignored.
Adding process 1187 for gameID 582500
ERROR: ld.so: object '/home/user/.var/app/com.valvesoftware.Steam/.local/share/Steam/ubuntu12_32/gameoverlayrenderer.so' from LD_PRELOAD cannot be preloaded (wrong ELF class: ELFCLASS32): ignored.
ERROR: ld.so: object '/home/user/.var/app/com.valvesoftware.Steam/.local/share/Steam/ubuntu12_32/gameoverlayrenderer.so' from LD_PRELOAD cannot be preloaded (wrong ELF class: ELFCLASS32): ignored.
ERROR: ld.so: object '/home/user/.var/app/com.valvesoftware.Steam/.local/share/Steam/ubuntu12_32/gameoverlayrenderer.so' from LD_PRELOAD cannot be preloaded (wrong ELF class: ELFCLASS32): ignored.
Adding process 1189 for gameID 582500
Adding process 1193 for gameID 582500
x86_64-linux-gnu-capsule-capture-libs: warning: Dependencies of libnvidia-pkcs11.so.550.90.07 not found, ignoring: Missing dependencies: Could not find "libcrypto.so.1.1" in LD_LIBRARY_PATH "/app/lib/i386-linux-gnu/GL/default/lib:/app/lib/i386-linux-gnu/GL/nvidia-550-90-07/lib:/app/lib32:/app/lib/i386-linux-gnu:/lib64:/app/lib:/usr/lib/x86_64-linux-gnu/GL/default/lib:/usr/lib/x86_64-linux-gnu/GL/nvidia-550-90-07/lib:/usr/lib/x86_64-linux-gnu/openh264/extra:/usr/lib/x86_64-linux-gnu:/mnt/user/games/SteamLibrary/steamapps/common/We Were Here", ld.so.cache, DT_RUNPATH or fallback /lib:/usr/lib
Adding process 1314 for gameID 582500
Proton: Upgrading prefix from None to 9.0-201 (/mnt/user/games/SteamLibrary/steamapps/compatdata/582500/)
ERROR: ld.so: object '/tmp/pressure-vessel-libs-FTSYQ2/${LIB}/libshared-library-guard.so' cannot be loaded as audit interface: cannot open shared object file; ignored.
/mnt/user/games/SteamLibrary/steamapps/common/Proton - Experimental/files/bin/wineserver: error while loading shared libraries: librt.so.1: cannot open shared object file: No such file or directory
ERROR: ld.so: object '/tmp/pressure-vessel-libs-FTSYQ2/${LIB}/libshared-library-guard.so' cannot be loaded as audit interface: cannot open shared object file; ignored.
steam-runtime-launcher-interface-0: error while loading shared libraries: libc.so.6: cannot open shared object file: No such file or directory
Uploaded AppInterfaceStats to Steam
Removing process 1314 for gameID 582500
Removing process 1193 for gameID 582500
Removing process 1189 for gameID 582500
Removing process 1187 for gameID 582500
chdir "/mnt/user/games/SteamLibrary/steamapps/common/We Were Here"
ERROR: ld.so: object '/home/user/.var/app/com.valvesoftware.Steam/.local/share/Steam/ubuntu12_32/gameoverlayrenderer.so' from LD_PRELOAD cannot be preloaded (wrong ELF class: ELFCLASS32): ignored.
Adding process 1499 for gameID 582500
ERROR: ld.so: object '/home/user/.var/app/com.valvesoftware.Steam/.local/share/Steam/ubuntu12_64/gameoverlayrenderer.so' from LD_PRELOAD cannot be preloaded (wrong ELF class: ELFCLASS64): ignored.
ERROR: ld.so: object '/home/user/.var/app/com.valvesoftware.Steam/.local/share/Steam/ubuntu12_32/gameoverlayrenderer.so' from LD_PRELOAD cannot be preloaded (wrong ELF class: ELFCLASS32): ignored.
ERROR: ld.so: object '/home/user/.var/app/com.valvesoftware.Steam/.local/share/Steam/ubuntu12_32/gameoverlayrenderer.so' from LD_PRELOAD cannot be preloaded (wrong ELF class: ELFCLASS32): ignored.
ERROR: ld.so: object '/home/user/.var/app/com.valvesoftware.Steam/.local/share/Steam/ubuntu12_32/gameoverlayrenderer.so' from LD_PRELOAD cannot be preloaded (wrong ELF class: ELFCLASS32): ignored.
Adding process 1500 for gameID 582500
Adding process 1501 for gameID 582500
x86_64-linux-gnu-capsule-capture-libs: warning: Dependencies of libnvidia-pkcs11.so.550.90.07 not found, ignoring: Missing dependencies: Could not find "libcrypto.so.1.1" in LD_LIBRARY_PATH "/app/lib/i386-linux-gnu/GL/default/lib:/app/lib/i386-linux-gnu/GL/nvidia-550-90-07/lib:/app/lib32:/app/lib/i386-linux-gnu:/lib64:/app/lib:/usr/lib/x86_64-linux-gnu/GL/default/lib:/usr/lib/x86_64-linux-gnu/GL/nvidia-550-90-07/lib:/usr/lib/x86_64-linux-gnu/openh264/extra:/usr/lib/x86_64-linux-gnu:/mnt/user/games/SteamLibrary/steamapps/common/We Were Here", ld.so.cache, DT_RUNPATH or fallback /lib:/usr/lib
Adding process 1590 for gameID 582500
Adding process 1591 for gameID 582500
fsync: up and running.
Adding process 1592 for gameID 582500
Adding process 1593 for gameID 582500
Adding process 1596 for gameID 582500
Adding process 1598 for gameID 582500
Adding process 1601 for gameID 582500
Adding process 1611 for gameID 582500
Adding process 1624 for gameID 582500
Adding process 1630 for gameID 582500
DRM kernel driver 'nvidia-drm' in use. NVK requires nouveau.
DRM kernel driver 'nvidia-drm' in use. NVK requires nouveau.
Adding process 1643 for gameID 582500
Setting breakpad minidump AppID = 582500
Steam_SetMinidumpSteamID:  Caching Steam ID:  76561198841363877 [API loaded no]
Adding process 1660 for gameID 582500
Adding process 1663 for gameID 582500
DRM kernel driver 'nvidia-drm' in use. NVK requires nouveau.
Fossilize INFO: Overriding serialization path: "/mnt/user/games/SteamLibrary/steamapps/shadercache/582500/fozpipelinesv6/steamapprun_pipeline_cache".
wine: setpriority -10 for pid -1 failed: 3
wine: setpriority -2 for pid -1 failed: 3
wine: setpriority 2 for pid -1 failed: 3
wine: setpriority 3 for pid -1 failed: 3
GameOverlay: started '/home/user/.var/app/com.valvesoftware.Steam/.local/share/Steam/ubuntu12_32/gameoverlayui' (pid 1730) for game process 1660
07/13 20:15:33 minidumps folder is set to /tmp/dumps
07/13 20:15:33 Init: Installing breakpad exception handler for appid(gameoverlayui)/version(20240620171414)/tid(1730)
07/13 20:15:33 Init: Installing breakpad exception handler for appid(gameoverlayui)/version(1.0)/tid(1730)
Adding process 1765 for gameID 582500
pid 1594 != 1593, skipping destruction (fork without exec?)
Game 582500 created interface STEAMAPPLIST_INTERFACE_VERSION001 / AppList
Game 582500 created interface STEAMAPPS_INTERFACE_VERSION008 / Apps
Game 582500 created interface STEAMHTMLSURFACE_INTERFACE_VERSION_005 / HTMLSurface
Game 582500 created interface STEAMHTTP_INTERFACE_VERSION003 / HTTP
Game 582500 created interface STEAMINVENTORY_INTERFACE_V003 / Inventory
Game 582500 created interface STEAMMUSICREMOTE_INTERFACE_VERSION001 / MusicRemote
Game 582500 created interface STEAMMUSIC_INTERFACE_VERSION001 / Music
Game 582500 created interface STEAMPARENTALSETTINGS_INTERFACE_VERSION001 / ParentalSettings
Game 582500 created interface STEAMREMOTEPLAY_INTERFACE_VERSION001 / RemotePlay
Game 582500 created interface STEAMREMOTESTORAGE_INTERFACE_VERSION014 / RemoteStorage
Game 582500 created interface STEAMSCREENSHOTS_INTERFACE_VERSION003 / Screenshots
Game 582500 created interface STEAMUGC_INTERFACE_VERSION013 / UGC
Game 582500 created interface STEAMUSERSTATS_INTERFACE_VERSION011 / UserStats
Game 582500 created interface STEAMVIDEO_INTERFACE_V002 / Video
Game 582500 created interface SteamController007 / Controller
Game 582500 created interface SteamFriends017 / Friends
Game 582500 created interface SteamInput001 / Controller
Game 582500 created interface SteamMatchGameSearch001 / GameSearch
Game 582500 created interface SteamMatchMaking009 / Matchmaking
Game 582500 created interface SteamMatchMakingServers002 / MatchmakingServers
Game 582500 created interface SteamNetworking005 / Networking
Game 582500 created interface SteamParties002 / Parties
Game 582500 created interface SteamUser020 / User
Game 582500 created interface SteamUtils009 / Utils
Game 582500 method call count for IClientUtils::RecordSteamInterfaceCreation : 29
Game 582500 method call count for IClientUtils::GetAppID : 31
Game 582500 method call count for IClientFriends::SetRichPresence : 4
Game 582500 method call count for IClientFriends::GetPersonaName : 1
Game 582500 method call count for IClientUser::GetSteamID : 4
Uploaded AppInterfaceStats to Steam
Removing process 1765 for gameID 582500
Removing process 1663 for gameID 582500
Removing process 1660 for gameID 582500
Removing process 1643 for gameID 582500
Removing process 1630 for gameID 582500
Removing process 1624 for gameID 582500
Removing process 1611 for gameID 582500
Removing process 1601 for gameID 582500
Removing process 1598 for gameID 582500
Removing process 1596 for gameID 582500
Removing process 1593 for gameID 582500
Removing process 1592 for gameID 582500
Removing process 1591 for gameID 582500
Removing process 1590 for gameID 582500
Removing process 1501 for gameID 582500
Removing process 1500 for gameID 582500
Removing process 1499 for gameID 582500

(process:1730): GLib-GObject-CRITICAL **: 20:15:51.124: g_object_unref: assertion 'G_IS_OBJECT (object)' failed
reaping pid: 1730 -- gameoverlayui
[2024-07-13 20:16:32] Background update loop checking for update. . .
[2024-07-13 20:16:32] Checking for available updates...
[2024-07-13 20:16:32] Downloading manifest: https://client-update.akamai.steamstatic.com/steam_client_ubuntu12?t=855190831
[2024-07-13 20:16:32] Manifest download: send request
[2024-07-13 20:16:32] Manifest download: waiting for download to finish
[2024-07-13 20:16:33] Manifest download: finished
[2024-07-13 20:16:33] Download skipped: /steam_client_ubuntu12?t=855190831 version 1718904662, installed version 1718904662, existing pending version 0
[2024-07-13 20:16:33] Nothing to do
[2024-07-13 20:39:59] Shutdown

Running from Lutris did not really return any more info about what is wrong. Tried some different launch options and at most all I got was this:

lutris-wrapper: Stellaris
Started initial process 5413 from /usr/bin/lsi-steam steam://rungameid/281990
Start monitoring process.
steam.sh[5413]: Running Steam on manjarolinux 24.0.3 64-bit
steam.sh[5413]: STEAM_RUNTIME is enabled by the user
setup.sh[5480]: Steam runtime environment up-to-date!
Monitored process exited.
Initial process has exited (return code: 0)
All processes have quit
Exit with return code 0

@Kobold

Well, I installed what other drivers were available and tried to use them as well, but got no other results.

From that I get this, not sure what to make of it?

systemctl --failed                                                                                                                                                                     ✔  27m 10s  

journalctl -p 3 -xb
  UNIT LOAD ACTIVE SUB DESCRIPTION

0 loaded units listed.
jul 13 19:32:19 user-m32cd4k kernel: x86/cpu: SGX disabled by BIOS.
jul 13 19:32:19 user-m32cd4k kernel: tpm_crb MSFT0101:00: [Firmware Bug]: ACPI region does not cover the entire command/response buffer. [mem 0xfed40000-0xfed4087f flags 0x200] vs fed40080 f80
jul 13 19:32:19 user-m32cd4k kernel: tpm_crb MSFT0101:00: [Firmware Bug]: ACPI region does not cover the entire command/response buffer. [mem 0xfed40000-0xfed4087f flags 0x200] vs fed40080 f80
jul 13 19:32:21 user-m32cd4k kernel: 
jul 13 19:32:21 user-m32cd4k kernel: pcieport 0000:00:1c.5: AER:   Error of this Agent is reported first
jul 13 19:32:21 user-m32cd4k kernel: pcieport 0000:00:1c.5: AER:   Error of this Agent is reported first
jul 13 19:32:21 user-m32cd4k kernel: pcieport 0000:00:1c.5: AER:   Error of this Agent is reported first
jul 13 19:32:21 user-m32cd4k kernel: pcieport 0000:00:1c.5: AER:   Error of this Agent is reported first
jul 13 19:32:23 user-m32cd4k kernel: pcieport 0000:00:1c.5: AER:   Error of this Agent is reported first
jul 13 19:32:23 user-m32cd4k kernel: pcieport 0000:00:1c.5: AER:   Error of this Agent is reported first
jul 13 19:32:23 user-m32cd4k kernel: pcieport 0000:00:1c.5: AER:   Error of this Agent is reported first
jul 13 19:32:23 user-m32cd4k kernel: pcieport 0000:00:1c.5: AER:   Error of this Agent is reported first
jul 13 19:53:23 user-m32cd4k systemd-coredump[7499]: [🡕] Process 7285 (steamwebhelper) of user 1000 dumped core.
                                                     
                                                     Stack trace of thread 7285:
                                                     #0  0x00007f467122c338 n/a (/home/user/.local/share/Steam/ubuntu12_64/libcef.so + 0x5c2c338)
                                                     #1  0x00007f466fd28837 n/a (/home/user/.local/share/Steam/ubuntu12_64/libcef.so + 0x4728837)
                                                     #2  0x00007f466fd25ac6 n/a (/home/user/.local/share/Steam/ubuntu12_64/libcef.so + 0x4725ac6)
                                                     #3  0x00007f466fd24943 n/a (/home/user/.local/share/Steam/ubuntu12_64/libcef.so + 0x4724943)
                                                     #4  0x00007f466fd2fcb4 n/a (/home/user/.local/share/Steam/ubuntu12_64/libcef.so + 0x472fcb4)
                                                     #5  0x00007f466fd31044 n/a (/home/user/.local/share/Steam/ubuntu12_64/libcef.so + 0x4731044)
                                                     #6  0x00007f466fb9203f n/a (/home/user/.local/share/Steam/ubuntu12_64/libcef.so + 0x459203f)
                                                     #7  0x00007f466fbf13a4 n/a (/home/user/.local/share/Steam/ubuntu12_64/libcef.so + 0x45f13a4)
                                                     #8  0x00007f466fbf15c9 n/a (/home/user/.local/share/Steam/ubuntu12_64/libcef.so + 0x45f15c9)
                                                     #9  0x00007f4671278126 n/a (/home/user/.local/share/Steam/ubuntu12_64/libcef.so + 0x5c78126)
                                                     #10 0x00007f4671291c9b n/a (/home/user/.local/share/Steam/ubuntu12_64/libcef.so + 0x5c91c9b)
                                                     #11 0x00007f46712924ea n/a (/home/user/.local/share/Steam/ubuntu12_64/libcef.so + 0x5c924ea)
                                                     #12 0x00007f46712333a4 n/a (/home/user/.local/share/Steam/ubuntu12_64/libcef.so + 0x5c333a4)
                                                     #13 0x00007f4671292bfc n/a (/home/user/.local/share/Steam/ubuntu12_64/libcef.so + 0x5c92bfc)
                                                     #14 0x00007f4671259f58 n/a (/home/user/.local/share/Steam/ubuntu12_64/libcef.so + 0x5c59f58)
                                                     #15 0x00007f466db6889a n/a (/home/user/.local/share/Steam/ubuntu12_64/libcef.so + 0x256889a)
                                                     #16 0x0000560b511f7faa n/a (/home/user/.local/share/Steam/ubuntu12_64/steamwebhelper + 0x2c2faa)
                                                     ELF object binary architecture: AMD x86-64
░░ Subject: Process 7285 (steamwebhelper) dumped core
░░ Defined-By: systemd
░░ Support: https://forum.manjaro.org/c/support
░░ Documentation: man:core(5)
░░ 
░░ Process 7285 (steamwebhelper) crashed and dumped core.
░░ 
░░ This usually indicates a programming error in the crashing program and
░░ should be reported to its vendor as a bug.
jul 13 19:56:46 user-m32cd4k kwin_wayland[736]: kwin_scene_opengl: Invalid framebuffer status:  "GL_FRAMEBUFFER_INCOMPLETE_ATTACHMENT"
jul 13 19:56:46 user-m32cd4k kwin_wayland[736]: kwin_scene_opengl: Can't enable invalid framebuffer object!
jul 13 20:00:58 user-m32cd4k kwin_wayland[736]: kwin_libinput: Libinput: event3  - SINOWEALTH Game Mouse: client bug: event processing lagging behind by 68ms, your system is too slow

With root filesystem I meant that /home is on the same partition as /, would not make much difference in this sense to have /home on another partitione with ext4 filesystem, I think?

Thank you for the tip and guide, looked through it and can’t find anything making any difference.

Show us the output plz:
inxi --admin --verbosity=5 --filter --no-host --width

Did you followed the steps in my guide?
Disable Fast Boot in Bios.
How to activate Steam Play and Proton?
To switch to Proprietary Driver for your nvidia card.

It all should make a difference… the question is, if you had your settings already done or not.

Did you try to start exact this game with the same Steam Proton settings under the non-flatpak steam install?

inxi output
System:
  Kernel: 6.6.34-1-MANJARO arch: x86_64 bits: 64 compiler: gcc v: 14.1.1
    clocksource: tsc avail: hpet,acpi_pm
    parameters: BOOT_IMAGE=/boot/vmlinuz-6.6-x86_64
    root=UUID=e400ca25-c26c-4971-ada2-ea1976da8b33 rw quiet splash
    resume=UUID=fd163784-4a3a-46be-b1dd-c1e6e11cda1e udev.log_priority=3
    nvidia_drm.modeset=1 nvidia_drm.fbdev=1
  Desktop: KDE Plasma v: 6.0.5 tk: Qt v: N/A info: frameworks v: 6.3.0
    wm: kwin_wayland vt: 1 dm: SDDM Distro: Manjaro base: Arch Linux
Machine:
  Type: Desktop System: ASUSTeK product: M32CD4-K v: 0604
    serial: <superuser required> Chassis: type: 3 v: 1.0
    serial: <superuser required>
  Mobo: ASUSTeK model: M32CD4-K v: Rev 1.xx serial: <superuser required>
    uuid: <superuser required> UEFI: American Megatrends v: 0604 date: 04/11/2017
Memory:
  System RAM: total: 16 GiB available: 15.58 GiB used: 2.23 GiB (14.3%)
  Message: For most reliable report, use superuser + dmidecode.
  Array-1: capacity: 32 GiB slots: 2 modules: 2 EC: None
    max-module-size: 16 GiB note: est.
  Device-1: ChannelA-DIMM0 type: DDR4 detail: synchronous size: 8 GiB
    speed: 2133 MT/s volts: curr: 1 width (bits): data: 64 total: 64
    manufacturer: SK Hynix part-no: HMA81GU6AFR8N-UH serial: <filter>
  Device-2: ChannelB-DIMM0 type: DDR4 detail: synchronous size: 8 GiB
    speed: 2133 MT/s volts: curr: 1 width (bits): data: 64 total: 64
    manufacturer: Corsair part-no: CMK8GX4M1A2400C14 serial: N/A
CPU:
  Info: model: Intel Core i5-7400 bits: 64 type: MCP arch: Kaby Lake
    gen: core 7 level: v3 note: check built: 2018 process: Intel 14nm family: 6
    model-id: 0x9E (158) stepping: 9 microcode: 0xF8
  Topology: cpus: 1x cores: 4 smt: <unsupported> cache: L1: 256 KiB
    desc: d-4x32 KiB; i-4x32 KiB L2: 1024 KiB desc: 4x256 KiB L3: 6 MiB
    desc: 1x6 MiB
  Speed (MHz): avg: 1325 high: 1500 min/max: 800/3500 scaling:
    driver: intel_pstate governor: powersave cores: 1: 800 2: 1500 3: 1500
    4: 1500 bogomips: 24008
  Flags: avx avx2 ht lm nx pae sse sse2 sse3 sse4_1 sse4_2 ssse3 vmx
  Vulnerabilities:
  Type: gather_data_sampling mitigation: Microcode
  Type: itlb_multihit status: KVM: VMX disabled
  Type: l1tf mitigation: PTE Inversion; VMX: conditional cache flushes, SMT
    disabled
  Type: mds mitigation: Clear CPU buffers; SMT disabled
  Type: meltdown mitigation: PTI
  Type: mmio_stale_data mitigation: Clear CPU buffers; SMT disabled
  Type: reg_file_data_sampling status: Not affected
  Type: retbleed mitigation: IBRS
  Type: spec_rstack_overflow status: Not affected
  Type: spec_store_bypass mitigation: Speculative Store Bypass disabled via
    prctl
  Type: spectre_v1 mitigation: usercopy/swapgs barriers and __user pointer
    sanitization
  Type: spectre_v2 mitigation: IBRS; IBPB: conditional; STIBP: disabled; RSB
    filling; PBRSB-eIBRS: Not affected; BHI: Not affected
  Type: srbds mitigation: Microcode
  Type: tsx_async_abort status: Not affected
Graphics:
  Device-1: NVIDIA GP106 [GeForce GTX 1060 6GB] vendor: ASUSTeK driver: nvidia
    v: 550.90.07 alternate: nouveau,nvidia_drm non-free: 545.xx+ status: current
    (as of 2024-06; EOL~2026-12-xx) arch: Pascal code: GP10x process: TSMC 16nm
    built: 2016-2021 pcie: gen: 3 speed: 8 GT/s lanes: 16 ports: active: none
    off: DVI-D-1 empty: DP-1, DP-2, HDMI-A-1, HDMI-A-2 bus-ID: 01:00.0
    chip-ID: 10de:1c03 class-ID: 0300
  Device-2: Logitech C920 PRO HD Webcam driver: snd-usb-audio,uvcvideo
    type: USB rev: 2.0 speed: 480 Mb/s lanes: 1 mode: 2.0 bus-ID: 1-5:2
    chip-ID: 046d:08e5 class-ID: 0102 serial: <filter>
  Display: wayland server: X.org v: 1.21.1.13 with: Xwayland v: 24.1.0
    compositor: kwin_wayland driver: X: loaded: nvidia gpu: nvidia display-ID: 0
  Monitor-1: DVI-D-1 res: 1920x1080 size: N/A modes: N/A
  API: EGL v: 1.5 hw: drv: nvidia platforms: device: 0 drv: nvidia device: 2
    drv: swrast gbm: drv: nvidia surfaceless: drv: nvidia wayland: drv: nvidia
    x11: drv: zink inactive: device-1
  API: OpenGL v: 4.6.0 compat-v: 4.5 vendor: nvidia mesa v: 550.90.07
    glx-v: 1.4 direct-render: yes renderer: NVIDIA GeForce GTX 1060 6GB/PCIe/SSE2
    memory: 5.86 GiB display-ID: :1.0
  API: Vulkan v: 1.3.279 layers: 5 device: 0 type: discrete-gpu name: NVIDIA
    GeForce GTX 1060 6GB driver: nvidia v: 550.90.07 device-ID: 10de:1c03
    surfaces: xcb,xlib,wayland
Audio:
  Device-1: Intel 100 Series/C230 Series Family HD Audio vendor: ASUSTeK
    driver: snd_hda_intel v: kernel alternate: snd_soc_avs bus-ID: 00:1f.3
    chip-ID: 8086:a170 class-ID: 0403
  Device-2: NVIDIA GP106 High Definition Audio vendor: ASUSTeK
    driver: snd_hda_intel v: kernel pcie: gen: 3 speed: 8 GT/s lanes: 16
    bus-ID: 01:00.1 chip-ID: 10de:10f1 class-ID: 0403
  Device-3: Logitech C920 PRO HD Webcam driver: snd-usb-audio,uvcvideo
    type: USB rev: 2.0 speed: 480 Mb/s lanes: 1 mode: 2.0 bus-ID: 1-5:2
    chip-ID: 046d:08e5 class-ID: 0102 serial: <filter>
  API: ALSA v: k6.6.34-1-MANJARO status: kernel-api with: aoss
    type: oss-emulator tools: alsactl,alsamixer,amixer
  Server-1: JACK v: 1.9.22 status: off tools: N/A
  Server-2: PipeWire v: 1.0.7 status: active with: 1: pipewire-pulse
    status: active 2: wireplumber status: active 3: pipewire-alsa type: plugin
    tools: pactl,pw-cat,pw-cli,wpctl
Network:
  Device-1: Realtek RTL8111/8168/8211/8411 PCI Express Gigabit Ethernet
    vendor: ASUSTeK driver: r8169 v: kernel pcie: gen: 1 speed: 2.5 GT/s lanes: 1
    port: d000 bus-ID: 02:00.0 chip-ID: 10ec:8168 class-ID: 0200
  IF: enp2s0 state: up speed: 1000 Mbps duplex: full mac: <filter>
  Device-2: Qualcomm Atheros QCA9377 802.11ac Wireless Network Adapter
    vendor: AzureWave driver: ath10k_pci v: kernel pcie: gen: 1 speed: 2.5 GT/s
    lanes: 1 bus-ID: 03:00.0 chip-ID: 168c:0042 class-ID: 0280
  IF: wlp3s0 state: down mac: <filter>
  Info: services: NetworkManager, systemd-timesyncd, wpa_supplicant
Bluetooth:
  Device-1: IMC Networks driver: btusb v: 0.8 type: USB rev: 1.1 speed: 12 Mb/s
    lanes: 1 mode: 1.1 bus-ID: 1-7:3 chip-ID: 13d3:3491 class-ID: e001
  Report: rfkill ID: hci0 rfk-id: 0 state: up address: see --recommends
Drives:
  Local Storage: total: 2.01 TiB used: 878.37 GiB (42.7%)
  SMART Message: Unable to run smartctl. Root privileges required.
  ID-1: /dev/sda maj-min: 8:0 vendor: Samsung model: SSD 870 EVO 250GB
    size: 232.89 GiB block-size: physical: 512 B logical: 512 B speed: 6.0 Gb/s
    tech: SSD serial: <filter> fw-rev: 2B6Q scheme: GPT
  ID-2: /dev/sdb maj-min: 8:16 vendor: Seagate model: ST1000DM010-2EP102
    size: 931.51 GiB block-size: physical: 4096 B logical: 512 B speed: 6.0 Gb/s
    tech: HDD rpm: 7200 serial: <filter> fw-rev: CC43 scheme: GPT
  ID-3: /dev/sdc maj-min: 8:32 vendor: Kingston model: SA400S37960G
    size: 894.25 GiB block-size: physical: 512 B logical: 512 B speed: 6.0 Gb/s
    tech: SSD serial: <filter> fw-rev: 61F1 scheme: GPT
  Optical-1: /dev/sr0 vendor: ASUS DVD model: RAM GHD1N rev: AS02
    dev-links: cdrom
Partition:
  ID-1: / raw-size: 215.46 GiB size: 211.01 GiB (97.94%)
    used: 34.36 GiB (16.3%) fs: ext4 dev: /dev/sda2 maj-min: 8:2 label: N/A
    uuid: e400ca25-c26c-4971-ada2-ea1976da8b33
  ID-2: /boot/efi raw-size: 300 MiB size: 299.4 MiB (99.80%)
    used: 296 KiB (0.1%) fs: vfat dev: /dev/sda1 maj-min: 8:1 label: N/A
    uuid: E6F0-BA80
Swap:
  Kernel: swappiness: 60 (default) cache-pressure: 100 (default) zswap: yes
    compressor: zstd max-pool: 20%
  ID-1: swap-1 type: partition size: 17.13 GiB used: 0 KiB (0.0%)
    priority: -2 dev: /dev/sda3 maj-min: 8:3 label: swap
    uuid: fd163784-4a3a-46be-b1dd-c1e6e11cda1e
Sensors:
  System Temperatures: cpu: 39.0 C pch: 42.0 C mobo: N/A
  Fan Speeds (rpm): N/A
Info:
  Processes: 239 Power: uptime: 1m states: freeze,mem,disk suspend: deep
    avail: s2idle wakeups: 0 hibernate: platform avail: shutdown, reboot,
    suspend, test_resume image: 6.22 GiB services: org_kde_powerdevil,
    power-profiles-daemon, upowerd Init: systemd v: 256 default: graphical
    tool: systemctl
  Packages: 1365 pm: pacman pkgs: 1355 libs: 373 tools: pamac,yay pm: flatpak
    pkgs: 10 Compilers: clang: 17.0.6 gcc: 14.1.1 Shell: Zsh v: 5.9 default: Bash
    v: 5.2.26 running-in: konsole inxi: 3.3.35

Yes, excuse me if I came off as a bit rude. I meant that I have checked it and it has been applied.
Fast boot N/A (not an option)
Proton and Steam Play is activated
Proprietary driver is installed

I did, and did it again now before responding and using experimental/default proton works running from flatpak but not from Steam Runtime nor from Lutris.