Yappi not up updating

I get the following error messages when trying to update yappi:

FAIL: test_run_as_script (test_functionality.BasicUsage)
Traceback (most recent call last):
  File "/var/tmp/pamac-build-sean/python-yappi/src/yappi-release/tests/test_functionality.py", line 371, in test_run_as_script
    self.assertEqual(p.returncode, 0)
AssertionError: 1 != 0

Ran 84 tests in 29.038s

FAILED (failures=1)
Running following tests: ['test_functionality', 'test_hooks', 'test_tags', 'test_asyncio', 'test_asyncio_context_vars']
==> ERROR: A failure occurred in check().

other than pycharm is it used for anything else or can I uninstall it or anyone know how to fix the update?

Talk to the developer of the package … use the links provided at AUR (en) - python-yappi

1 Like

This topic was automatically closed 2 days after the last reply. New replies are no longer allowed.