Parallels tools 不能安装成功

Mac下使用Parallels虚拟机安装Manjaro系统,并在Manjaro中安装Parallels tools,提示安装失败,详情如下,有人遇到这种情况吗?

Log文件及内容如下(/var/log/parallels-tools-install.log):
2019-10-17T17:59:24+0800:

Parallels Tools 13.3.0-43321 Installer started.
2019-10-17T17:59:24+0800: Failed to setup console printk level.
2019-10-17T17:59:29+0800: execCmd: ./installer/pm.sh --check gtools [0]
Started installation of Parallels Guest Tools version '13.3.0.43321'

2019年 10月 17日 星期四 17:59:33 CST
Start installation or upgrade of Guest Tools
new version of parallels tools
Installed Guest Tools were not found
Perform installation into the /usr/lib/parallels-tools directory
cat: /usr/lib/parallels-tools/kmods/../version: 没有那个文件或目录
make: 进入目录“/usr/lib/parallels-tools/kmods”
cd prl_eth/pvmnet && make
make[1]: 进入目录“/usr/lib/parallels-tools/kmods/prl_eth/pvmnet”
make -C /lib/modules/4.19.79-1-MANJARO/build M=/usr/lib/parallels-tools/kmods/prl_eth/pvmnet
make[2]: 进入目录“/usr/lib/modules/4.19.79-1-MANJARO/build”
CC [M] /usr/lib/parallels-tools/kmods/prl_eth/pvmnet/pvmnet.o
LD [M] /usr/lib/parallels-tools/kmods/prl_eth/pvmnet/prl_eth.o
Building modules, stage 2.
MODPOST 1 modules
FATAL: modpost: GPL-incompatible module prl_eth.ko uses GPL-only symbol 'sev_enable_key'
make[3]: *** [scripts/Makefile.modpost:92:__modpost] 错误 1
make[2]: *** [Makefile:1523:modules] 错误 2
make[2]: 离开目录“/usr/lib/modules/4.19.79-1-MANJARO/build”
make[1]: *** [/usr/lib/parallels-tools/kmods/prl_eth/pvmnet/Makefile.v26:11:all] 错误 2
make[1]: 离开目录“/usr/lib/parallels-tools/kmods/prl_eth/pvmnet”
make: *** [Makefile.kmods:34:installme] 错误 2
make: 离开目录“/usr/lib/parallels-tools/kmods”
Error: could not build kernel modules
Error: failed to install kernel modules
Error: failed to install Parallels Guest Tools!
Please, look at /var/log/parallels-tools-install.log file for more information.
2019-10-17T17:59:34+0800: execCmd: ./install --install [143]
2019-10-17T17:59:34+0800: Error: An error occurred when installing Parallels Tools. Please go to /var/log/parallels-tools-install.log for more information.
2019-10-17T17:59:36+0800: Exiting with code 1

大概是這個問題?

Forum kindly sponsored by